Opened 15 years ago

Closed 15 years ago

#233 closed defect (fixed)

test_fit_time_and_mem fails on Nautilus

Reported by: ole Owned by: duncan
Priority: normal Milestone:
Component: Appearance and visualisation Version:
Severity: normal Keywords:
Cc:

Description


Ran 1 test in 1978.414s

OK test_fit_time_and_mem (main.Test_uq) ... FAIL

====================================================================== FAIL: test_fit_time_and_mem (main.Test_uq)


Traceback (most recent call last):

File "validate_benchmark_fit.py", line 58, in test_fit_time_and_mem

self.assert_(time<time_standard*1.2)

AssertionError?


Ran 1 test in 53.579s

FAILED (failures=1)

Change History (1)

comment:1 Changed 15 years ago by duncan

  • Resolution set to fixed
  • Status changed from new to closed
Note: See TracTickets for help on using tickets.